Target
Cannabinoid receptor 2
Ligand
BDBM50265621
Substrate
Meas. Tech.
ChEMBL_633626 (CHEMBL1117884)
Ki
22.7±n/a nM
Citation
 Allen, JGFotsch, CBabij, P Emerging targets in osteoporosis disease modification. J Med Chem 53:4332-53 (2010)  
Target
Name:
Cannabinoid receptor 2
Synonyms:
CANNABINOID CB2 CB2 CB2B CNR2_HUMAN Cannabinoid CB2 receptor Cannabinoid receptor 2 (CB2R) | hCB2
Type:
G Protein-Coupled Receptor (GPCR)
Mol. Mass.:
39690.94
Organism:
Homo sapiens (Human)
Description:
P34972
Residue:
360
  
Inhibitor
Name:
BDBM50265621
Synonyms:
((1R,4S,5R)-4-(2,6-dimethoxy-4-(2-methyloctan-2-yl)phenyl)-6,6-dimethylbicyclo[3.1.1]hept-2-en-2-yl)methanol CHEMBL497392 | HU-308
Type:
Small organic molecule
Emp. Form.:
C27H42O3
Mol. Mass.:
414.6206
SMILES:
CCCCCCC(C)(C)c1cc(OC)c([C@H]2C=C(CO)[C@@H]3C[C@H]2C3(C)C)c(OC)c1
: