Target
Cannabinoid receptor 2
Ligand
BDBM21279
Substrate
Meas. Tech.
ChEMBL_633626 (CHEMBL1117884)
Ki
2290±n/a nM
Citation
 Allen, JGFotsch, CBabij, P Emerging targets in osteoporosis disease modification. J Med Chem 53:4332-53 (2010)  
Target
Name:
Cannabinoid receptor 2
Synonyms:
CANNABINOID CB2 CB2 CB2B CNR2_HUMAN Cannabinoid CB2 receptor Cannabinoid receptor 2 (CB2R) | hCB2
Type:
G Protein-Coupled Receptor (GPCR)
Mol. Mass.:
39690.94
Organism:
Homo sapiens (Human)
Description:
P34972
Residue:
360
  
Inhibitor
Name:
BDBM21279
Synonyms:
1-(2,4-dichlorophenyl)-5-(4-iodophenyl)-4-methyl-N-(piperidin-1-yl)-1H-pyrazole-3-carboxamide AM-251 CHEMBL285932 | N-(piperidin-1-yl)-1-(2,4-dichlorophenyl)-5-(4-iodophenyl)-4-methyl-1H-pyrazole-3-carboxamide
Type:
Small organic molecule
Emp. Form.:
C22H21Cl2IN4O
Mol. Mass.:
555.239
SMILES:
Cc1c(nn(c1-c1ccc(I)cc1)-c1ccc(Cl)cc1Cl)C(=O)NN1CCCCC1
: