Target
Integrin alpha-V/beta-3
Ligand
BDBM50100971
Substrate
Meas. Tech.
ChEMBL_633352 (CHEMBL1120572)
IC50
33.5±n/a nM
Citation
 Allen, JGFotsch, CBabij, P Emerging targets in osteoporosis disease modification. J Med Chem 53:4332-53 (2010)  
Target
Name:
Integrin alpha-V/beta-3
Synonyms:
ITGAV/ITGB3 | Integrin beta-3/Vitronectin receptor alpha
Type:
Enzyme
Mol. Mass.:
Description:
Components:
This complex has 2 components.
Component 1
Name:
Integrin alpha-V
Synonyms:
ITAV_HUMAN Integrin alpha-V/alpha-5 VNRA Vitronectin receptor | Vitronectin receptor subunit alpha
Type:
PROTEIN
Mol. Mass.:
116024.92
Organism:
Homo sapiens (Human)
Description:
ChEMBL_582336
Residue:
1048
  
Component 2
Name:
Integrin beta-3
Synonyms:
CD_antigen=CD61 GPIIIa ITGB3 Platelet membrane glycoprotein IIIa
Type:
Protein
Mol. Mass.:
87038.91
Organism:
Homo sapiens (Human)
Description:
P05106
Residue:
788
  
Inhibitor
Name:
BDBM50100971
Synonyms:
CHEMBL40929 | N-(3,5-dichlorophenyl)imidodicarbonimidic diamide
Type:
Small organic molecule
Emp. Form.:
C8H9Cl2N5
Mol. Mass.:
246.097
SMILES:
NC(=N)N=C(N)Nc1cc(Cl)cc(Cl)c1
: