Target
Aurora kinase B
Ligand
BDBM50319620
Substrate
Meas. Tech.
ChEMBL_634452 (CHEMBL1119478)
Ki
4±n/a nM
Citation
 Wang, SMidgley, CAScaërou, FGrabarek, JBGriffiths, GJackson, WKontopidis, GMcClue, SJMcInnes, CMeades, CMezna, MPlater, AStuart, IThomas, MPWood, GClarke, RGBlake, DGZheleva, DILane, DPJackson, RCGlover, DMFischer, PM Discovery of N-phenyl-4-(thiazol-5-yl)pyrimidin-2-amine aurora kinase inhibitors. J Med Chem 53:4367-78 (2010)  
Target
Name:
Aurora kinase B
Synonyms:
AIK2 AIM1 ARK2 AURKB_HUMAN Aurora B-INCENP Aurora kinase B (AURKB) STK-1 STK12 Serine/threonine-protein kinase aurora B
Type:
Protein
Mol. Mass.:
39327.72
Organism:
Homo sapiens (Human)
Description:
Q96GD4
Residue:
344
  
Inhibitor
Name:
BDBM50319620
Synonyms:
CHEMBL1084715 | N-(4-(4-(2-(Ethylamino)-4-methylthiazol-5-yl)pyrimidin-2-ylamino)benzyl)acetamide
Type:
Small organic molecule
Emp. Form.:
C19H22N6OS
Mol. Mass.:
382.483
SMILES:
CCNc1nc(C)c(s1)-c1ccnc(Nc2ccc(CNC(C)=O)cc2)n1
: