Target
Vasopressin V2 receptor
Ligand
BDBM50319774
Substrate
Meas. Tech.
ChEMBL_634857 (CHEMBL1120489)
Ki
54±n/a nM
Citation
 Crombie, ALAntrilli, TMCampbell, BACrandall, DLFailli, AAHe, YKern, JCMoore, WJNogle, LMTrybulski, EJ Synthesis and evaluation of azabicyclo[3.2.1]octane derivatives as potent mixed vasopressin antagonists. Bioorg Med Chem Lett 20:3742-5 (2010)  
Target
Name:
Vasopressin V2 receptor
Synonyms:
ADHR AVPR2 DIR Renal-type arginine vasopressin receptor V2R_HUMAN Vasopressin V2 receptor | Vasopressin receptor
Type:
Receptor
Mol. Mass.:
40295.28
Organism:
Homo sapiens (Human)
Description:
P30518
Residue:
371
  
Inhibitor
Name:
BDBM50319774
Synonyms:
(3-chloro-2'-methylbiphenyl-4-yl)((1S,5R)-1,3,3-trimethyl-6-azabicyclo[3.2.1]octan-6-yl)methanone | CHEMBL1086272
Type:
Small organic molecule
Emp. Form.:
C24H28ClNO
Mol. Mass.:
381.938
SMILES:
Cc1ccccc1-c1ccc(C(=O)N2C[C@]3(C)C[C@H]2CC(C)(C)C3)c(Cl)c1
: