Target
Neuronal acetylcholine receptor subunit alpha-7
Ligand
BDBM50319960
Substrate
Meas. Tech.
ChEMBL_635043 (CHEMBL1118594)
Ki
3.1±n/a nM
Citation
 Li, TBunnelle, WHRyther, KBAnderson, DJMalysz, JHelfrich, RGrønlien, JHHåkerud, MPeters, DSchrimpf, MRGopalakrishnan, MJi, J Syntheses and structure-activity relationship (SAR) studies of 2,5-diazabicyclo[2.2.1]heptanes as novel alpha7 neuronal nicotinic receptor (NNR) ligands. Bioorg Med Chem Lett 20:3636-9 (2010)  
Target
Name:
Neuronal acetylcholine receptor subunit alpha-7
Synonyms:
ACHA7_RAT Cholinergic, Nicotinic Alpha7 Chrna7 Neuronal acetylcholine receptor (alpha7 nAChR) Neuronal acetylcholine receptor subunit alpha-7 Neuronal acetylcholine receptor subunit alpha-7 (nAChR)
Type:
Enzyme
Mol. Mass.:
56502.44
Organism:
Rattus norvegicus (Rat)
Description:
Q05941
Residue:
502
  
Inhibitor
Name:
BDBM50319960
Synonyms:
(1S,4S)-2-methyl-5-(5-phenylpyridin-2-yl)-2,5-diazabicyclo[2.2.1]heptane | CHEMBL1085824
Type:
Small organic molecule
Emp. Form.:
C17H19N3
Mol. Mass.:
265.3529
SMILES:
CN1C[C@@H]2C[C@H]1CN2c1ccc(cn1)-c1ccccc1
: