Target
Neuronal acetylcholine receptor subunit alpha-7
Ligand
BDBM50319962
Substrate
Meas. Tech.
ChEMBL_635043 (CHEMBL1118594)
Ki
2.9±n/a nM
Citation
 Li, TBunnelle, WHRyther, KBAnderson, DJMalysz, JHelfrich, RGrønlien, JHHåkerud, MPeters, DSchrimpf, MRGopalakrishnan, MJi, J Syntheses and structure-activity relationship (SAR) studies of 2,5-diazabicyclo[2.2.1]heptanes as novel alpha7 neuronal nicotinic receptor (NNR) ligands. Bioorg Med Chem Lett 20:3636-9 (2010)  
Target
Name:
Neuronal acetylcholine receptor subunit alpha-7
Synonyms:
ACHA7_RAT Cholinergic, Nicotinic Alpha7 Chrna7 Neuronal acetylcholine receptor (alpha7 nAChR) Neuronal acetylcholine receptor subunit alpha-7 Neuronal acetylcholine receptor subunit alpha-7 (nAChR)
Type:
Enzyme
Mol. Mass.:
56502.44
Organism:
Rattus norvegicus (Rat)
Description:
Q05941
Residue:
502
  
Inhibitor
Name:
BDBM50319962
Synonyms:
(1S,4S)-2-(5-(benzo[b]thiophen-5-yl)pyridin-2-yl)-5-methyl-2,5-diazabicyclo[2.2.1]heptane | CHEMBL1085090
Type:
Small organic molecule
Emp. Form.:
C19H19N3S
Mol. Mass.:
321.439
SMILES:
CN1C[C@@H]2C[C@H]1CN2c1ccc(cn1)-c1ccc2sccc2c1
: