Target
Aldo-keto reductase family 1 member B1
Ligand
BDBM50321718
Substrate
Meas. Tech.
ChEMBL_640040 (CHEMBL1174254)
IC50
21±n/a nM
Citation
 Endo, SMatsunaga, TKuwata, KZhao, HTEl-Kabbani, OKitade, YHara, A Chromene-3-carboxamide derivatives discovered from virtual screening as potent inhibitors of the tumour maker, AKR1B10. Bioorg Med Chem 18:2485-90 (2010)  
Target
Name:
Aldo-keto reductase family 1 member B1
Synonyms:
AKR1B1 ALDR_HUMAN AR Aldose Reductase (ALR2) Aldose reductase (AR)
Type:
Protein
Mol. Mass.:
35855.50
Organism:
Homo sapiens (Human)
Description:
P15121. 4LAU; 2IKI; 4LB4; 2FZD; 2FZ8; 1US0
Residue:
316
  
Inhibitor
Name:
BDBM50321718
Synonyms:
2-(2,4-dimethoxyphenylimino)-7-hydroxy-N-(pyridin-2-yl)-2H-chromene-3-carboxamide | CHEMBL1171546
Type:
Small organic molecule
Emp. Form.:
C23H19N3O5
Mol. Mass.:
417.4141
SMILES:
COc1ccc(\N=c2/oc3cc(O)ccc3cc2C(=O)Nc2ccccn2)c(OC)c1
: