Target
High affinity choline transporter 1
Ligand
BDBM50149890
Substrate
Meas. Tech.
ChEMBL_644789 (CHEMBL1211032)
Ki
260015.96±n/a nM
Citation
 Geldenhuys, WJAllen, DDLockman, PR 3-D-QSAR and docking studies on the neuronal choline transporter. Bioorg Med Chem Lett 20:4870-7 (2010)  
Target
Name:
High affinity choline transporter 1
Synonyms:
Choline transporter SC5A7_MOUSE | Slc5a7
Type:
PROTEIN
Mol. Mass.:
63358.06
Organism:
Mus musculus
Description:
ChEMBL_644789
Residue:
580
  
Inhibitor
Name:
BDBM50149890
Synonyms:
CHEMBL9324 | tetraethylammonium
Type:
Small organic molecule
Emp. Form.:
C8H20N
Mol. Mass.:
130.2506
SMILES:
CC[N+](CC)(CC)CC
: