Target
5-hydroxytryptamine receptor 6
Ligand
BDBM50324878
Substrate
Meas. Tech.
ChEMBL_651485 (CHEMBL1227602)
IC50
422±n/a nM
Citation
 Park, CMKim, SYPark, WKChoi, JHSeong, CM Synthesis and SAR of (piperazin-1-yl-phenyl)-arylsulfonamides: a novel series of atypical antipsychotic agents. Bioorg Med Chem Lett 20:5221-4 (2010)  
Target
Name:
5-hydroxytryptamine receptor 6
Synonyms:
5-HT-6 5-hydroxytryptamine receptor 6 (5-HT-6) 5-hydroxytryptamine receptor 6 (5HT6) HTR6 Serotonin 6 (5-HT6) receptor | Serotonin Receptor 6
Type:
G Protein-Coupled Receptor (GPCR)
Mol. Mass.:
46968.43
Organism:
Homo sapiens (Human)
Description:
P50406
Residue:
440
  
Inhibitor
Name:
BDBM50324878
Synonyms:
CHEMBL1222136 | naphthalene-2-sulfonic acid isopropyl-[6-(pyridin-3-yloxy)-pyridin-3-yl]-amide
Type:
Small organic molecule
Emp. Form.:
C23H21N3O3S
Mol. Mass.:
419.496
SMILES:
CC(C)N(c1ccc(Oc2cccnc2)nc1)S(=O)(=O)c1ccc2ccccc2c1
: