Target
D(3) dopamine receptor
Ligand
BDBM50324866
Substrate
Meas. Tech.
ChEMBL_651490 (CHEMBL1227607)
IC50
1195±n/a nM
Citation
 Park, CMKim, SYPark, WKChoi, JHSeong, CM Synthesis and SAR of (piperazin-1-yl-phenyl)-arylsulfonamides: a novel series of atypical antipsychotic agents. Bioorg Med Chem Lett 20:5221-4 (2010)  
Target
Name:
D(3) dopamine receptor
Synonyms:
DOPAMINE D3 DRD3_HUMAN Dopamine D3 receptor (D3) Dopamine receptor Dopamine receptor D3
Type:
Mol. Mass.:
44243.43
Organism:
Homo sapiens (Human)
Description:
Residue:
400
  
Inhibitor
Name:
BDBM50324866
Synonyms:
CHEMBL1222234 | Naphthalene-1-sulfonic acid isopropyl-[3-(4-methyl-piperazin-1-yl)-phenyl]-amide
Type:
Small organic molecule
Emp. Form.:
C24H29N3O2S
Mol. Mass.:
423.571
SMILES:
CC(C)N(c1cccc(c1)N1CCN(C)CC1)S(=O)(=O)c1cccc2ccccc12
: