Target
Beta-secretase 1
Ligand
BDBM50324922
Substrate
Meas. Tech.
ChEMBL_651539 (CHEMBL1227791)
IC50
7000±n/a nM
Citation
 Madden, JDod, JRGodemann, RKraemer, JSmith, MBiniszkiewicz, MHallett, DJBarker, JDyekjaer, JDHesterkamp, T Fragment-based discovery and optimization of BACE1 inhibitors. Bioorg Med Chem Lett 20:5329-33 (2010)  
Target
Name:
Beta-secretase 1
Synonyms:
ASP2 Aspartyl protease 2 BACE1 Beta-secretase (BACE) Beta-secretase 1 (BACE 1) Beta-secretase 1 (BACE1) Beta-site amyloid precursor protein cleaving enzyme 1 Memapsin-2 beta-Secretase (BACE-1) | beta-Secretase (BACE1)
Type:
Protein
Mol. Mass.:
55755.10
Organism:
Homo sapiens (Human)
Description:
P56817
Residue:
501
  
Inhibitor
Name:
BDBM50324922
Synonyms:
(3S)-3-(2-amino-5-chloro-1H-benzimidazol-1-yl)-N-(cyclohexylmethyl)pentanamide CHEMBL1222240
Type:
Small organic molecule
Emp. Form.:
C19H27ClN4O
Mol. Mass.:
362.897
SMILES:
CC[C@@H](CC(=O)NCC1CCCCC1)n1c(N)nc2cc(Cl)ccc12
: