Target
Procathepsin L
Ligand
BDBM50240948
Substrate
Meas. Tech.
ChEMBL_652318 (CHEMBL1225521)
Ki
9300±n/a nM
Citation
 Waag, TGelhaus, CRath, JStich, ALeippe, MSchirmeister, T Allicin and derivates are cysteine protease inhibitors with antiparasitic activity. Bioorg Med Chem Lett 20:5541-3 (2010)  
Target
Name:
Procathepsin L
Synonyms:
CATL1_HUMAN CTSL CTSL1 Cathepsin L Cathepsin L1 heavy chain MEP cathepsin L preproprotein
Type:
Enzyme
Mol. Mass.:
37557.19
Organism:
Homo sapiens (Human)
Description:
Purchased from Calbiochem (San Diego, CA).
Residue:
333
  
Inhibitor
Name:
BDBM50240948
Synonyms:
CHEMBL359965 allicin | thio-2-propene-1-sulfinic acid S-allyl ester
Type:
Small organic molecule
Emp. Form.:
C6H10OS2
Mol. Mass.:
162.273
SMILES:
C=CCSS(=O)CC=C
: