Target
Ephrin type-B receptor 2
Ligand
BDBM4552
Substrate
Meas. Tech.
ChEMBL_655540 (CHEMBL1244584)
IC50
8.5±n/a nM
Citation
 Remsing Rix, LLRix, UColinge, JHantschel, OBennett, KLStranzl, TMüller, ABaumgartner, CValent, PAugustin, MTill, JHSuperti-Furga, G Global target profile of the kinase inhibitor bosutinib in primary chronic myeloid leukemia cells. Leukemia 23:477-85 (2009)  
Target
Name:
Ephrin type-B receptor 2
Synonyms:
DRT ELK-related tyrosine kinase EPH-like kinase 5 EPHB2_HUMAN EPTH3 Ephrin receptor TYRO5
Type:
PROTEIN
Mol. Mass.:
117491.44
Organism:
Homo sapiens (Human)
Description:
ChEMBL_1476221
Residue:
1055
  
Inhibitor
Name:
BDBM4552
Synonyms:
4-[(2,4-Dichloro-5-methoxyphenyl)amino]-6-methoxy-7-[3-(4-methyl-1-piperazinyl)propoxy]-3-quinolinecarbonitrile BOSUTINIB SKI-606
Type:
Small organic molecule
Emp. Form.:
C26H29Cl2N5O3
Mol. Mass.:
530.446
SMILES:
COc1cc(Nc2c(cnc3cc(OCCCN4CCN(C)CC4)c(OC)cc23)C#N)c(Cl)cc1Cl
: