Target
Tyrosine-protein kinase Fes/Fps
Ligand
BDBM50326053
Substrate
Meas. Tech.
ChEMBL_655793 (CHEMBL1244837)
Kd
>10000±n/a nM
Citation
 Zarrinkar, PPGunawardane, RNCramer, MDGardner, MFBrigham, DBelli, BKaraman, MWPratz, KWPallares, GChao, QSprankle, KGPatel, HKLevis, MArmstrong, RCJames, JBhagwat, SS AC220 is a uniquely potent and selective inhibitor of FLT3 for the treatment of acute myeloid leukemia (AML). Blood 114:2984-92 (2009)  
Target
Name:
Tyrosine-protein kinase Fes/Fps
Synonyms:
FES FPS Tyrosine-protein kinase Fes/Fps
Type:
Enzyme
Mol. Mass.:
93498.99
Organism:
Homo sapiens (Human)
Description:
P07332
Residue:
822
  
Inhibitor
Name:
BDBM50326053
Synonyms:
CHEMBL608533 | PKC-412
Type:
Small organic molecule
Emp. Form.:
C35H30N4O4
Mol. Mass.:
570.6371
SMILES:
CO[C@@H]1[C@@H](C[C@H]2O[C@]1(C)n1c3ccccc3c3c4CNC(=O)c4c4c5ccccc5n2c4c13)N(C)C(=O)c1ccccc1
: