Target
LIM domain kinase 1
Ligand
BDBM16673
Substrate
Meas. Tech.
ChEMBL_655437 (CHEMBL1244481)
Kd
1600±n/a nM
Citation
 Zarrinkar, PPGunawardane, RNCramer, MDGardner, MFBrigham, DBelli, BKaraman, MWPratz, KWPallares, GChao, QSprankle, KGPatel, HKLevis, MArmstrong, RCJames, JBhagwat, SS AC220 is a uniquely potent and selective inhibitor of FLT3 for the treatment of acute myeloid leukemia (AML). Blood 114:2984-92 (2009)  
Target
Name:
LIM domain kinase 1
Synonyms:
LIMK LIMK1 | LIMK1_HUMAN
Type:
Enzyme Catalytic Domain
Mol. Mass.:
72591.81
Organism:
Homo sapiens (Human)
Description:
gi_4505001
Residue:
647
  
Inhibitor
Name:
BDBM16673
Synonyms:
4-[4-({[4-chloro-3-(trifluoromethyl)phenyl]carbamoyl}amino)phenoxy]-N-methylpyridine-2-carboxamide BAY 43-9006 BAY439006 Hit compound, 8 Sorafenib US10183928, Sorafenib US10227329, Compound Sorafenib US10774070, Compound Sorafenib US11279688, Compound Sorafenib US9029401, Sorafenib US9902709, Comparative example 1 cid_216239
Type:
Small organic molecule
Emp. Form.:
C21H16ClF3N4O3
Mol. Mass.:
464.825
SMILES:
CNC(=O)c1cc(Oc2ccc(NC(=O)Nc3ccc(Cl)c(c3)C(F)(F)F)cc2)ccn1
: