Target
Histamine H2 receptor
Ligand
BDBM50326286
Substrate
Meas. Tech.
ChEMBL_659950 (CHEMBL1247351)
Ki
>10000±n/a nM
Citation
 Ishikawa, MWatanabe, TKudo, TYokoyama, FYamauchi, MKato, KKakui, NSato, Y Investigation of the histamine H3 receptor binding site. Design and synthesis of hybrid agonists with a lipophilic side chain. J Med Chem 53:6445-56 (2010)  
Target
Name:
Histamine H2 receptor
Synonyms:
Gastric receptor I HISTAMINE H2 HRH2_HUMAN Histamine H2-Gs alpha S
Type:
G Protein-Coupled Receptor (GPCR)
Mol. Mass.:
40115.31
Organism:
Homo sapiens (Human)
Description:
Residue:
359
  
Inhibitor
Name:
BDBM50326286
Synonyms:
(R)-4-(1-(1H-Imidazol-4-yl)-2-(4-(trifluoromethyl)phenylthio)ethyl)piperidine | CHEMBL1243395
Type:
Small organic molecule
Emp. Form.:
C17H20F3N3S
Mol. Mass.:
355.421
SMILES:
FC(F)(F)c1ccc(SC[C@H](C2CCNCC2)c2cnc[nH]2)cc1
: