Target
B1 bradykinin receptor
Ligand
BDBM50326708
Substrate
Meas. Tech.
ChEMBL_662792 (CHEMBL1252531)
Ki
0.35±n/a nM
Citation
 Huang, HPlayer, MR Bradykinin B1 receptor antagonists as potential therapeutic agents for pain. J Med Chem 53:5383-99 (2010)  
Target
Name:
B1 bradykinin receptor
Synonyms:
B1 BRADYKININ B1R BK-1 receptor BRADYB1 | Bradykinin B1 receptor
Type:
Enzyme
Mol. Mass.:
40508.87
Organism:
Homo sapiens (Human)
Description:
P46663
Residue:
353
  
Inhibitor
Name:
BDBM50326708
Synonyms:
CHEMBL1254771 | N-(4-(4,5-dihydro-1H-imidazol-2-yl)benzyl)-2-(2-(4-methoxy-N,2,6-trimethylphenylsulfonamido)ethoxy)-N-methylacetamide
Type:
Small organic molecule
Emp. Form.:
C25H34N4O5S
Mol. Mass.:
502.626
SMILES:
COc1cc(C)c(c(C)c1)S(=O)(=O)N(C)CCOCC(=O)N(C)Cc1ccc(cc1)C1=NCCN1
: