Target
Oxytocin receptor
Ligand
BDBM50263856
Substrate
Meas. Tech.
ChEMBL_661577 (CHEMBL1253141)
Ki
28±n/a nM
Citation
 Borthwick, AD Oral oxytocin antagonists. J Med Chem 53:6525-38 (2010)  
Target
Name:
Oxytocin receptor
Synonyms:
OT-R OXYR_HUMAN | Oxytocin
Type:
Enzyme Catalytic Domain
Mol. Mass.:
42793.26
Organism:
Homo sapiens (Human)
Description:
Oxytocin OXTR HEK293::B2R9L7
Residue:
389
  
Inhibitor
Name:
BDBM50263856
Synonyms:
5-(3-(4-ethoxy-3-methylphenyl)-5-(ethoxymethyl)-4H-1,2,4-triazol-4-yl)-2-methoxypyridine | CHEMBL492029
Type:
Small organic molecule
Emp. Form.:
C20H24N4O3
Mol. Mass.:
368.4296
SMILES:
CCOCc1nnc(-c2ccc(OCC)c(C)c2)n1-c1ccc(OC)nc1
: