Target
Oxytocin receptor
Ligand
BDBM50416840
Substrate
Meas. Tech.
ChEMBL_661588 (CHEMBL1251522)
Ki
3.16±n/a nM
Citation
 Borthwick, AD Oral oxytocin antagonists. J Med Chem 53:6525-38 (2010)  
Target
Name:
Oxytocin receptor
Synonyms:
OT-R OXYR_HUMAN | Oxytocin
Type:
Enzyme Catalytic Domain
Mol. Mass.:
42793.26
Organism:
Homo sapiens (Human)
Description:
Oxytocin OXTR HEK293::B2R9L7
Residue:
389
  
Inhibitor
Name:
BDBM50416840
Synonyms:
CHEMBL196603
Type:
Small organic molecule
Emp. Form.:
C30H40N4O3
Mol. Mass.:
504.6636
SMILES:
CC(C)C[C@H]1N([C@@H](C(=O)NC(C)C)c2ccc(cc2)N(C)C)C(=O)[C@H](NC1=O)C1Cc2ccccc2C1
: