Target
Maltase-glucoamylase
Ligand
BDBM50327503
Substrate
Meas. Tech.
ChEMBL_664635 (CHEMBL1260349)
Ki
15±n/a nM
Citation
 Eskandari, RJones, KRose, DRPinto, BM Probing the active-site requirements of human intestinal N-terminal maltase glucoamylase: the effect of replacing the sulfate moiety by a methyl ether in ponkoranol, a naturally occurringa-glucosidase inhibitor. Bioorg Med Chem Lett 20:5686-9 (2010)  
Target
Name:
Maltase-glucoamylase
Synonyms:
Alpha glucosidase MGA MGAML Maltase | Maltase-glucoamylase, intestinal
Type:
Enzyme
Mol. Mass.:
209817.06
Organism:
Homo sapiens (Human)
Description:
O43451
Residue:
1857
  
Inhibitor
Name:
BDBM50327503
Synonyms:
(1R,2R,3S,4S)-3,4-dihydroxy-2-(hydroxymethyl)-1-((2S,3S,4R,5R)-2,3,4,5,6-pentahydroxyhexyl)tetrahydro-1H-thiophenium chloride | CHEMBL1258643
Type:
Small organic molecule
Emp. Form.:
C11H23O8S
Mol. Mass.:
315.36
SMILES:
OC[C@@H](O)[C@@H](O)[C@H](O)[C@H](O)C[S@@+]1C[C@@H](O)[C@H](O)[C@H]1CO
: