Target
D(2) dopamine receptor
Ligand
BDBM50327615
Substrate
Meas. Tech.
ChEMBL_664672 (CHEMBL1260558)
Ki
0.877±n/a nM
Citation
 Favor, DAPowers, JJWhite, ADFitzgerald, LWGroppi, VSerpa, KA 6-Alkoxyisoindolin-1-one based dopamine D2 partial agonists as potential antipsychotics. Bioorg Med Chem Lett 20:5666-9 (2010)  
Target
Name:
D(2) dopamine receptor
Synonyms:
D(2) dopamine receptor DOPAMINE D2 Long DRD2 Dopamine D2 receptor Dopamine D2 receptor (D2R) Dopamine2-like | d2
Type:
Cell-surface receptors
Mol. Mass.:
50647.10
Organism:
Homo sapiens (Human)
Description:
P14416
Residue:
443
  
Inhibitor
Name:
BDBM50327615
Synonyms:
5-fluoro-6-(4-(4-(naphthalen-1-yl)piperazin-1-yl)butoxy)isoindolin-1-one | CHEMBL1258534
Type:
Small organic molecule
Emp. Form.:
C26H28FN3O2
Mol. Mass.:
433.5178
SMILES:
Fc1cc2CNC(=O)c2cc1OCCCCN1CCN(CC1)c1cccc2ccccc12
: