Target
5-hydroxytryptamine receptor 1A
Ligand
BDBM50327592
Substrate
Meas. Tech.
ChEMBL_664675 (CHEMBL1260561)
Ki
0.88±n/a nM
Citation
 Favor, DAPowers, JJWhite, ADFitzgerald, LWGroppi, VSerpa, KA 6-Alkoxyisoindolin-1-one based dopamine D2 partial agonists as potential antipsychotics. Bioorg Med Chem Lett 20:5666-9 (2010)  
Target
Name:
5-hydroxytryptamine receptor 1A
Synonyms:
5-HT-1A 5-hydroxytryptamine receptor 1A (5-HT-1A) ADRB2RL1 Dopamine D2 receptor and serotonin 1a receptor HTR1A | Serotonin receptor 1A
Type:
Mol. Mass.:
46122.49
Organism:
Homo sapiens (Human)
Description:
Residue:
422
  
Inhibitor
Name:
BDBM50327592
Synonyms:
5-fluoro-6-(3-(4-(6-fluoronaphthalen-1-yl)piperazin-1-yl)propoxy)isoindolin-1-one | CHEMBL1258763
Type:
Small organic molecule
Emp. Form.:
C25H25F2N3O2
Mol. Mass.:
437.4817
SMILES:
Fc1ccc2c(cccc2c1)N1CCN(CCCOc2cc3C(=O)NCc3cc2F)CC1
: