Target
5-hydroxytryptamine receptor 1A
Ligand
BDBM50327600
Substrate
Meas. Tech.
ChEMBL_664675 (CHEMBL1260561)
Ki
1.44±n/a nM
Citation
 Favor, DAPowers, JJWhite, ADFitzgerald, LWGroppi, VSerpa, KA 6-Alkoxyisoindolin-1-one based dopamine D2 partial agonists as potential antipsychotics. Bioorg Med Chem Lett 20:5666-9 (2010)  
Target
Name:
5-hydroxytryptamine receptor 1A
Synonyms:
5-HT-1A 5-hydroxytryptamine receptor 1A (5-HT-1A) ADRB2RL1 Dopamine D2 receptor and serotonin 1a receptor HTR1A | Serotonin receptor 1A
Type:
Mol. Mass.:
46122.49
Organism:
Homo sapiens (Human)
Description:
Residue:
422
  
Inhibitor
Name:
BDBM50327600
Synonyms:
6-(3-(4-(8-fluoronaphthalen-1-yl)piperazin-1-yl)propoxy)-5-methylisoindolin-1-one | CHEMBL1257970
Type:
Small organic molecule
Emp. Form.:
C26H28FN3O2
Mol. Mass.:
433.5178
SMILES:
Cc1cc2CNC(=O)c2cc1OCCCN1CCN(CC1)c1cccc2cccc(F)c12
: