Target
5-hydroxytryptamine receptor 2A
Ligand
BDBM50327628
Substrate
Meas. Tech.
ChEMBL_664673 (CHEMBL1260559)
Ki
11.2±n/a nM
Citation
 Favor, DAPowers, JJWhite, ADFitzgerald, LWGroppi, VSerpa, KA 6-Alkoxyisoindolin-1-one based dopamine D2 partial agonists as potential antipsychotics. Bioorg Med Chem Lett 20:5666-9 (2010)  
Target
Name:
5-hydroxytryptamine receptor 2A
Synonyms:
5-HT-2 5-HT2A 5-hydroxytryptamine receptor 2A (5HT-2A) 5HT2A_HUMAN HTR2A | Serotonin receptor 2A
Type:
undefined
Mol. Mass.:
52607.65
Organism:
Homo sapiens (Human)
Description:
P28223
Residue:
471
  
Inhibitor
Name:
BDBM50327628
Synonyms:
6-(4-(4-(isochroman-5-yl)piperazin-1-yl)butoxy)isoindolin-1-one | CHEMBL1257968
Type:
Small organic molecule
Emp. Form.:
C25H31N3O3
Mol. Mass.:
421.5319
SMILES:
O=C1NCc2ccc(OCCCCN3CCN(CC3)c3cccc4COCCc34)cc12
: