Target
Alpha-1B adrenergic receptor
Ligand
BDBM50328499
Substrate
Meas. Tech.
ChEMBL_665666 (CHEMBL1261597)
Ki
0.15±n/a nM
Citation
 Kristensen, JLPüschl, AJensen, MRisgaard, RChristoffersen, CTBang-Andersen, BBalle, T Exploring the neuroleptic substituent in octoclothepin: potential ligands for positron emission tomography with subnanomolar affinity fora(1)-adrenoceptors. J Med Chem 53:7021-34 (2010)  
Target
Name:
Alpha-1B adrenergic receptor
Synonyms:
ADA1B_RAT Alpha 1B-adrenoceptor Alpha adrenergic receptor 1A and 1B Alpha-1Adrenoceptor Alpha-1B adrenoreceptor | adrenergic Alpha1B
Type:
G Protein-Coupled Receptor (GPCR)
Mol. Mass.:
56606.71
Organism:
Rattus norvegicus (rat)
Description:
Receptor binding assays were performed using rat cortical membranes.
Residue:
515
  
Inhibitor
Name:
BDBM50328499
Synonyms:
1-Methyl-4-[8-(1-methyl-1H-tetrazol-5-ylmethyl)-10,11-dihydrodibenzo-[b,f]thiepin-10-yl]piperazine | CHEMBL1259129
Type:
Small organic molecule
Emp. Form.:
C22H26N6S
Mol. Mass.:
406.547
SMILES:
CN1CCN(CC1)C1Cc2ccccc2Sc2ccc(Cc3nnnn3C)cc12
: