Target
Alpha-1A adrenergic receptor
Ligand
BDBM50328506
Substrate
Meas. Tech.
ChEMBL_665656 (CHEMBL1261587)
Ki
0.16±n/a nM
Citation
 Kristensen, JLPüschl, AJensen, MRisgaard, RChristoffersen, CTBang-Andersen, BBalle, T Exploring the neuroleptic substituent in octoclothepin: potential ligands for positron emission tomography with subnanomolar affinity fora(1)-adrenoceptors. J Med Chem 53:7021-34 (2010)  
Target
Name:
Alpha-1A adrenergic receptor
Synonyms:
ADA1A_BOVIN ADRA1C Alpha 1A-adrenoreceptor Cerebral cortex alpha adrenergic receptor | adrenergic Alpha1
Type:
Enzyme Catalytic Domain
Mol. Mass.:
51492.08
Organism:
CALF
Description:
adrenergic Alpha1 0 CALF
Residue:
466
  
Inhibitor
Name:
BDBM50328506
Synonyms:
(S)-N-((11-(4-methylpiperazin-1-yl)-10,11-dihydrodibenzo[b,f]thiepin-2-yl)methyl)isobutyramide | CHEMBL1259190
Type:
Small organic molecule
Emp. Form.:
C24H31N3OS
Mol. Mass.:
409.587
SMILES:
CC(C)C(=O)NCc1ccc2Sc3ccccc3C[C@H](N3CCN(C)CC3)c2c1
: