Target
Histamine H1 receptor
Ligand
BDBM50328474
Substrate
Meas. Tech.
ChEMBL_665661 (CHEMBL1261592)
Ki
64±n/a nM
Citation
 Kristensen, JLPüschl, AJensen, MRisgaard, RChristoffersen, CTBang-Andersen, BBalle, T Exploring the neuroleptic substituent in octoclothepin: potential ligands for positron emission tomography with subnanomolar affinity fora(1)-adrenoceptors. J Med Chem 53:7021-34 (2010)  
Target
Name:
Histamine H1 receptor
Synonyms:
H1R HISTAMINE H1 HRH1_HUMAN
Type:
G Protein-Coupled Receptor (GPCR)
Mol. Mass.:
55808.72
Organism:
Homo sapiens (Human)
Description:
Cell pellets from SK-N-MC cells transfected with human H1 receptor were used in binding assay.
Residue:
487
  
Inhibitor
Name:
BDBM50328474
Synonyms:
1-(2-(4-(5-(aminomethyl)-1-(4-fluorophenyl)-1H-indol-3-yl)piperidin-1-yl)ethyl)imidazolidin-2-one | CHEMBL1259172
Type:
Small organic molecule
Emp. Form.:
C25H30FN5O
Mol. Mass.:
435.537
SMILES:
NCc1ccc2n(cc(C3CCN(CCN4CCNC4=O)CC3)c2c1)-c1ccc(F)cc1
: