Target
Serine/threonine-protein kinase mTOR
Ligand
BDBM50328605
Substrate
Meas. Tech.
ChEMBL_665716 (CHEMBL1261685)
IC50
5±n/a nM
Citation
 Liu, QChang, JWWang, JKang, SAThoreen, CCMarkhard, AHur, WZhang, JSim, TSabatini, DMGray, NS Discovery of 1-(4-(4-propionylpiperazin-1-yl)-3-(trifluoromethyl)phenyl)-9-(quinolin-3-yl)benzo[h][1,6]naphthyridin-2(1H)-one as a highly potent, selective mammalian target of rapamycin (mTOR) inhibitor for the treatment of cancer. J Med Chem 53:7146-55 (2010)  
Target
Name:
Serine/threonine-protein kinase mTOR
Synonyms:
FK506-binding protein 12-rapamycin complex-associated protein 1 Frap MTOR_MOUSE Mechanistic target of rapamycin RAPT1 Serine/threonine-protein kinase mTOR | Serine/threonine-protein kinase mTOR (mTOR)
Type:
Enzyme
Mol. Mass.:
288814.44
Organism:
Mus musculus (Mouse)
Description:
Q9JLN9
Residue:
2549
  
Inhibitor
Name:
BDBM50328605
Synonyms:
1-(4-(4-(2-(4-methylpiperazin-1-yl)acetyl)piperazin-1-yl)-3-(trifluoromethyl)phenyl)-9-(quinolin-3-yl)benzo[h][1,6]naphthyridin-2(1H)-one | CHEMBL1256458
Type:
Small organic molecule
Emp. Form.:
C39H36F3N7O2
Mol. Mass.:
691.744
SMILES:
CN1CCN(CC(=O)N2CCN(CC2)c2ccc(cc2C(F)(F)F)-n2c3c(ccc2=O)cnc2ccc(cc32)-c2cnc3ccccc3c2)CC1
: