Target
Inosine-5'-monophosphate dehydrogenase 1
Ligand
BDBM50054017
Substrate
Meas. Tech.
ChEMBL_686239 (CHEMBL1292995)
IC50
150±n/a nM
Citation
 Mitsuhashi, STakenaka, JIwamori, KNakajima, NUbukata, M Structure-activity relationships for inhibition of inosine monophosphate dehydrogenase and differentiation induction of K562 cells among the mycophenolic acid derivatives. Bioorg Med Chem 18:8106-11 (2010)  
Target
Name:
Inosine-5'-monophosphate dehydrogenase 1
Synonyms:
IMDH1_HUMAN IMPD 1 IMPDH-I Inosine Monophosphate Dehydrogenase Type 1 (IMPDH1) | Inosine-5'-monophosphate dehydrogenase (IMPDH)
Type:
Enzyme
Mol. Mass.:
55407.70
Organism:
Homo sapiens (Human)
Description:
Recombinant IMPDH1 expressed in E. coli.
Residue:
514
  
Inhibitor
Name:
BDBM50054017
Synonyms:
(E)-6-(4,6-Dihydroxy-7-methyl-3-oxo-1,3-dihydro-isobenzofuran-5-yl)-4-methyl-hex-4-enoic acid CHEMBL132727
Type:
Small organic molecule
Emp. Form.:
C16H18O6
Mol. Mass.:
306.3105
SMILES:
C\C(CCC(O)=O)=C/Cc1c(O)c2C(=O)OCc2c(C)c1O
: