Target
Melanin-concentrating hormone receptor 1
Ligand
BDBM50331252
Substrate
Meas. Tech.
ChEMBL_686508 (CHEMBL1292295)
Ki
11.2±n/a nM
Citation
 Surman, MDFreeman, EEGrabowski, JFHadden, MHenderson, AJJiang, GJiang, XMLuche, MKhmelnitsky, YVickers, SViggers, JCheetham, SGuzzo, PR 5-(pyridinon-1-yl)indazoles and 5-(furopyridinon-5-yl)indazoles as MCH-1 antagonists. Bioorg Med Chem Lett 20:7015-9 (2010)  
Target
Name:
Melanin-concentrating hormone receptor 1
Synonyms:
G-protein coupled receptor 24 MCH receptor 1 MCH-R1 MCHR-1 MCHR1_HUMAN Melanin-Concentrating Hormone Receptor 1 (MCH1R) Melanin-concentrating hormone receptor 1 (MCH-1) Melanin-concentrating hormone receptor 1 (MCHR-1) SLC-1 Somatostatin receptor-like protein
Type:
G Protein-Coupled Receptor (GPCR)
Mol. Mass.:
45976.27
Organism:
Homo sapiens (Human)
Description:
Membranes from CHO-K1 cells stably expressing human MCH1R were used in assays.
Residue:
422
  
Inhibitor
Name:
BDBM50331252
Synonyms:
(R)-4-(benzyloxy)-1-(1-(2-(2-(methoxymethyl)pyrrolidin-1-yl)ethyl)-1H-indazol-5-yl)pyridin-2(1H)-one | CHEMBL1289054
Type:
Small organic molecule
Emp. Form.:
C27H30N4O3
Mol. Mass.:
458.5521
SMILES:
COC[C@H]1CCCN1CCn1ncc2cc(ccc12)-n1ccc(OCc2ccccc2)cc1=O
: