Target
Interleukin-1 receptor-associated kinase 1
Ligand
BDBM50331612
Substrate
Meas. Tech.
ChEMBL_687459 (CHEMBL1292135)
Ki
>1000000±n/a nM
Citation
 Krug, MErlenkamp, GSippl, WSchächtele, CTotzke, FHilgeroth, A Discovery and selectivity-profiling of 4-benzylamino 1-aza-9-oxafluorene derivatives as lead structures for IGF-1R inhibitors. Bioorg Med Chem Lett 20:6915-9 (2010)  
Target
Name:
Interleukin-1 receptor-associated kinase 1
Synonyms:
IRAK IRAK1 Interleukin-1 receptor-associated kinase 1 (IRAK-1)
Type:
Enzyme
Mol. Mass.:
76536.81
Organism:
Homo sapiens (Human)
Description:
P51617
Residue:
712
  
Inhibitor
Name:
BDBM50331612
Synonyms:
CHEMBL1290072 | N-(4-methoxybenzyl)benzofuro[2,3-b]pyridin-4-amine
Type:
Small organic molecule
Emp. Form.:
C19H16N2O2
Mol. Mass.:
304.3425
SMILES:
COc1ccc(CNc2ccnc3oc4ccccc4c23)cc1
: