Target
Acidic mammalian chitinase
Ligand
BDBM10880
Substrate
Meas. Tech.
ChEMBL_686889 (CHEMBL1291258)
IC50
>1000000±n/a nM
Citation
 Schüttelkopf, AWGros, LBlair, DEFrearson, JAvan Aalten, DMGilbert, IH Acetazolamide-based fungal chitinase inhibitors. Bioorg Med Chem 18:8334-40 (2010)  
Target
Name:
Acidic mammalian chitinase
Synonyms:
AMCase CHIA Lung-specific protein TSA1902
Type:
Protein
Mol. Mass.:
52266.66
Organism:
Homo sapiens (Human)
Description:
Q9BZP6
Residue:
476
  
Inhibitor
Name:
BDBM10880
Synonyms:
AZA AZM acetazolamide Acetazolamide Acetazolamide (AZA) Acetazolamide, 5 Acetazolamide, AZA CHEMBL20 Sulfonamide, 1 US11278534, Example acetazolamide sulfonamide 1
Type:
Small organic molecule
Emp. Form.:
C4H6N4O3S2
Mol. Mass.:
222.245
SMILES:
CC(=O)Nc1nnc(s1)S(N)(=O)=O
: