Target
Myeloperoxidase
Ligand
BDBM50162708
Substrate
Meas. Tech.
ChEMBL_695893 (CHEMBL1640945)
IC50
130±n/a nM
Citation
 Soubhye, JPrévost, MVan Antwerpen, PZouaoui Boudjeltia, KRousseau, AFurtmüller, PGObinger, CVanhaeverbeek, MDucobu, JNéve, JGelbcke, MDufrasne, FO Structure-based design, synthesis, and pharmacological evaluation of 3-(aminoalkyl)-5-fluoroindoles as myeloperoxidase inhibitors. J Med Chem 53:8747-59 (2010)  
Target
Name:
Myeloperoxidase
Synonyms:
84 kDa myeloperoxidase MPO Myeloperoxidase Myeloperoxidase heavy chain PERM_HUMAN
Type:
Enzyme
Mol. Mass.:
83888.32
Organism:
Homo sapiens (Human)
Description:
P05164
Residue:
745
  
Inhibitor
Name:
BDBM50162708
Synonyms:
3-(5-fluoro-1H-indol-3-yl)-N,N-dimethylpropan-1-amine [3-(5-Fluoro-1H-indol-3-yl)-propyl]-dimethyl-amine
Type:
Small organic molecule
Emp. Form.:
C13H17FN2
Mol. Mass.:
220.2859
SMILES:
CN(C)CCCc1c[nH]c2ccc(F)cc12
: