Target
Aldehyde oxidase 1
Ligand
BDBM24778
Substrate
Meas. Tech.
ChEMBL_696369 (CHEMBL1640082)
IC50
110±n/a nM
Citation
 Pryde, DCDalvie, DHu, QJones, PObach, RSTran, TD Aldehyde oxidase: an enzyme of emerging importance in drug discovery. J Med Chem 53:8441-60 (2010)  
Target
Name:
Aldehyde oxidase 1
Synonyms:
AOX1 Aldehyde oxidase
Type:
PROTEIN
Mol. Mass.:
147702.30
Organism:
Macaca fascicularis
Description:
ChEMBL_696369
Residue:
1338
  
Inhibitor
Name:
BDBM24778
Synonyms:
2-methyl-1,4-dihydronaphthalene-1,4-dione CHEMBL590 Menadione (5d) Menadione, 9 cid_4055
Type:
Small organic molecule
Emp. Form.:
C11H8O2
Mol. Mass.:
172.18
SMILES:
CC1=CC(=O)c2ccccc2C1=O
: