Target
Ectonucleotide pyrophosphatase/phosphodiesterase family member 2
Ligand
BDBM50332926
Substrate
Meas. Tech.
ChEMBL_694284 (CHEMBL1637646)
Ki
187±n/a nM
Citation
 East, JEKennedy, AJTomsig, JLDe Leon, ARLynch, KRMacdonald, TL Synthesis and structure-activity relationships of tyrosine-based inhibitors of autotaxin (ATX). Bioorg Med Chem Lett 20:7132-6 (2010)  
Target
Name:
Ectonucleotide pyrophosphatase/phosphodiesterase family member 2
Synonyms:
ATX Autotaxin (ATX) ENPP2 Ectonucleotide Pyrophosphatase/Phosphodiesterase 2 (ENPP2) Extracellular lysophospholipase D PDNP2
Type:
Enzyme
Mol. Mass.:
99007.13
Organism:
Homo sapiens (Human)
Description:
Q13822
Residue:
863
  
Inhibitor
Name:
BDBM50332926
Synonyms:
3-((3-(4-fluorobenzyl)-2,4-dioxothiazolidin-5-ylidene)methyl)benzoic acid | CHEMBL1632622
Type:
Small organic molecule
Emp. Form.:
C18H12FNO4S
Mol. Mass.:
357.356
SMILES:
OC(=O)c1cccc(\C=C2/SC(=O)N(Cc3ccc(F)cc3)C2=O)c1
: