Target
C-X-C chemokine receptor type 4
Ligand
BDBM50333884
Substrate
Meas. Tech.
ChEMBL_700061 (CHEMBL1646838)
IC50
13±n/a nM
Citation
 Skerlj, RBridger, GMcEachern, EHarwig, CSmith, CWilson, TVeale, DYee, HCrawford, JSkupinska, KWauthy, RYang, WZhu, YBogucki, DDi Fluri, MLangille, JHuskens, DDe Clercq, ESchols, D Synthesis and SAR of novel CXCR4 antagonists that are potent inhibitors of T tropic (X4) HIV-1 replication. Bioorg Med Chem Lett 21:262-6 (2010)  
Target
Name:
C-X-C chemokine receptor type 4
Synonyms:
C-X-C chemokine receptor type 4 CD_antigen=CD184 CXCR-4 CXCR4_HUMAN Fusin LCR1 Leukocyte-derived seven transmembrane domain receptor SDF-1 receptor | Stromal cell-derived factor 1 receptor
Type:
Enzyme
Mol. Mass.:
39754.61
Organism:
Homo sapiens (Human)
Description:
P61073
Residue:
352
  
Inhibitor
Name:
BDBM50333884
Synonyms:
(S)-N-((1H-benzo[d]imidazol-2-yl)methyl)-N-(4-(aminomethyl)thiophen-3-yl)-5,6,7,8-tetrahydroquinolin-8-amine | CHEMBL1644081
Type:
Small organic molecule
Emp. Form.:
C22H23N5S
Mol. Mass.:
389.517
SMILES:
NCc1cscc1N(Cc1nc2ccccc2[nH]1)[C@H]1CCCc2cccnc12
: