Target
C-X-C chemokine receptor type 4
Ligand
BDBM50333889
Substrate
Meas. Tech.
ChEMBL_700061 (CHEMBL1646838)
IC50
21±n/a nM
Citation
 Skerlj, RBridger, GMcEachern, EHarwig, CSmith, CWilson, TVeale, DYee, HCrawford, JSkupinska, KWauthy, RYang, WZhu, YBogucki, DDi Fluri, MLangille, JHuskens, DDe Clercq, ESchols, D Synthesis and SAR of novel CXCR4 antagonists that are potent inhibitors of T tropic (X4) HIV-1 replication. Bioorg Med Chem Lett 21:262-6 (2010)  
Target
Name:
C-X-C chemokine receptor type 4
Synonyms:
C-X-C chemokine receptor type 4 CD_antigen=CD184 CXCR-4 CXCR4_HUMAN Fusin LCR1 Leukocyte-derived seven transmembrane domain receptor SDF-1 receptor | Stromal cell-derived factor 1 receptor
Type:
Enzyme
Mol. Mass.:
39754.61
Organism:
Homo sapiens (Human)
Description:
P61073
Residue:
352
  
Inhibitor
Name:
BDBM50333889
Synonyms:
CHEMBL1644089 | N-((1H-benzo[d]imidazol-2-yl)methyl)-N-((2-(aminomethyl)furan-3-yl)methyl)-5,6,7,8-tetrahydroquinolin-8-amine
Type:
Small organic molecule
Emp. Form.:
C23H25N5O
Mol. Mass.:
387.4775
SMILES:
NCc1occc1CN(Cc1nc2ccccc2[nH]1)C1CCCc2cccnc12
: