Target
Mitogen-activated protein kinase 8
Ligand
BDBM50333999
Substrate
Meas. Tech.
ChEMBL_701207 (CHEMBL1648827)
IC50
7200±n/a nM
Citation
 Probst, GDBowers, SSealy, JMTruong, APHom, RKGalemmo, RAKonradi, AWSham, HLQuincy, DAPan, HYao, NLin, MTóth, GArtis, DRZmolek, WWong, KQin, ALorentzen, CNakamura, DFQuinn, KPSauer, JMPowell, KRuslim, LWright, SChereau, DRen, ZAnderson, JPBard, FYednock, TAGriswold-Prenner, I Highly selective c-Jun N-terminal kinase (JNK) 2 and 3 inhibitors with in vitro CNS-like pharmacokinetic properties prevent neurodegeneration. Bioorg Med Chem Lett 21:315-9 (2010)  
Target
Name:
Mitogen-activated protein kinase 8
Synonyms:
JNK-46 JNK1-alpha-1 MK08_HUMAN PRKM8 SAPK1C c-Jun N-terminal kinase 1 c-Jun N-terminal kinase 1(JNK1) | c-Jun N-terminal kinase 2 (JNK2)
Type:
Enzyme
Mol. Mass.:
48297.57
Organism:
Homo sapiens (Human)
Description:
JNK-1 was purchased from Upstate Cell Signaling Solutions (formerly Upstate Biotechnology).
Residue:
427
  
Inhibitor
Name:
BDBM50333999
Synonyms:
CHEMBL1644629 | N-(4-(4-(naphthalen-2-yl)-5-oxo-4,5-dihydro-1H-1,2,4-triazol-3-yl)pyridin-2-yl)acetamide
Type:
Small organic molecule
Emp. Form.:
C19H15N5O2
Mol. Mass.:
345.3547
SMILES:
CC(=O)Nc1cc(ccn1)-c1n[nH]c(=O)n1-c1ccc2ccccc2c1
: