Target
Mineralocorticoid receptor
Ligand
BDBM50334048
Substrate
Meas. Tech.
ChEMBL_701337 (CHEMBL1648957)
Ki
21±n/a nM
Citation
 Roach, SLHiguchi, RIHudson, ARAdams, MESyka, PMMais, DEMiner, JNMarschke, KBZhi, L Tetrahydroquinoline glucocorticoid receptor agonists: discovery of a 3-hydroxyl for improving receptor selectivity. Bioorg Med Chem Lett 21:168-71 (2010)  
Target
Name:
Mineralocorticoid receptor
Synonyms:
MCR MLR NR3C2 | Nuclear receptor subfamily 3 group C member 2
Type:
Enzyme
Mol. Mass.:
107076.42
Organism:
Homo sapiens (Human)
Description:
P08235
Residue:
984
  
Inhibitor
Name:
BDBM50334048
Synonyms:
(-)-5-chloro-6-(1H-indol-7-yl)-2,2,4,8-tetramethyl-1,2,3,4-tetrahydroquinoline CHEMBL258191 | racemic-5-chloro-6-(1H-indol-7-yl)-2,2,4,8-tetramethyl-1,2,3,4-tetrahydroquinoline
Type:
Small organic molecule
Emp. Form.:
C21H23ClN2
Mol. Mass.:
338.874
SMILES:
CC1CC(C)(C)Nc2c(C)cc(c(Cl)c12)-c1cccc2cc[nH]c12
: