Target
5-hydroxytryptamine receptor 6
Ligand
BDBM50334732
Substrate
Meas. Tech.
ChEMBL_699278 (CHEMBL1647098)
Ki
1±n/a nM
Citation
 Liu, KGRobichaud, AJGreenfield, AALo, JRGrosanu, CMattes, JFCai, YZhang, GMZhang, JYKowal, DMSmith, DLDi, LKerns, EHSchechter, LEComery, TA Identification of 3-sulfonylindazole derivatives as potent and selective 5-HT(6) antagonists. Bioorg Med Chem 19:650-62 (2011)  
Target
Name:
5-hydroxytryptamine receptor 6
Synonyms:
5-HT-6 5-hydroxytryptamine receptor 6 (5-HT-6) 5-hydroxytryptamine receptor 6 (5HT6) HTR6 Serotonin 6 (5-HT6) receptor | Serotonin Receptor 6
Type:
G Protein-Coupled Receptor (GPCR)
Mol. Mass.:
46968.43
Organism:
Homo sapiens (Human)
Description:
P50406
Residue:
440
  
Inhibitor
Name:
BDBM50334732
Synonyms:
3-(3-Chlorophenylsulfonyl)-N-(piperidin-4-yl)-1H-indazol-5-amine HCl | CHEMBL1642882
Type:
Small organic molecule
Emp. Form.:
C18H19ClN4O2S
Mol. Mass.:
390.887
SMILES:
Clc1cccc(c1)S(=O)(=O)c1n[nH]c2ccc(NC3CCNCC3)cc12
: