Target
Cannabinoid receptor 2
Ligand
BDBM50326618
Substrate
Meas. Tech.
ChEMBL_717853 (CHEMBL1670561)
Ki
0.64±n/a nM
Citation
 Brogi, SCorelli, FDi Marzo, VLigresti, AMugnaini, CPasquini, STafi, A Three-dimensional quantitative structure-selectivity relationships analysis guided rational design of a highly selective ligand for the cannabinoid receptor 2. Eur J Med Chem 46:547-55 (2011)  
Target
Name:
Cannabinoid receptor 2
Synonyms:
CANNABINOID CB2 CB2 CB2B CNR2_HUMAN Cannabinoid CB2 receptor Cannabinoid receptor 2 (CB2R) | hCB2
Type:
G Protein-Coupled Receptor (GPCR)
Mol. Mass.:
39690.94
Organism:
Homo sapiens (Human)
Description:
P34972
Residue:
360
  
Inhibitor
Name:
BDBM50326618
Synonyms:
CHEMBL1254015 | [11C]-3-(2-methoxyethyl)-4,5-dimethyl-3H-thiazol-(2Z)-ylidene]amide]
Type:
Small organic molecule
Emp. Form.:
C16H26N2O2S
Mol. Mass.:
310.455
SMILES:
COCCn1c(C)c(C)sc1=NC(=O)C1C(C)(C)C1(C)C
: