Target
Lactoylglutathione lyase
Ligand
BDBM50336272
Substrate
Meas. Tech.
ChEMBL_716549 (CHEMBL1670273)
Ki
12900±n/a nM
Citation
 Yuan, MLuo, MSong, YXu, QWang, XCao, YBu, XRen, YHu, X Identification of curcumin derivatives as human glyoxalase I inhibitors: A combination of biological evaluation, molecular docking, 3D-QSAR and molecular dynamics simulation studies. Bioorg Med Chem 19:1189-96 (2011)  
Target
Name:
Lactoylglutathione lyase
Synonyms:
Aldoketomutase Glx I Glyoxalase I LGUL_HUMAN S-D-lactoylglutathione methylglyoxal lyase
Type:
Enzyme
Mol. Mass.:
20772.95
Organism:
Homo sapiens (Human)
Description:
Q04760
Residue:
184
  
Inhibitor
Name:
BDBM50336272
Synonyms:
Acemetacin [1-(4-Chloro-benzoyl)-5-methoxy-2-methyl-1H-indol-3-yl]-acetic acid carboxymethyl ester
Type:
Small organic molecule
Emp. Form.:
C21H18ClNO6
Mol. Mass.:
415.824
SMILES:
COc1ccc2n(C(=O)c3ccc(Cl)cc3)c(C)c(CC(=O)OCC(O)=O)c2c1
: