Target
Phospholipase A2
Ligand
BDBM50336352
Substrate
Meas. Tech.
ChEMBL_716743 (CHEMBL1670625)
IC50
12800±n/a nM
Citation
 Wang, JBourguet-Kondracki, MLLongeon, ADubois, JValentin, ACopp, BR Chemical and biological explorations of the electrophilic reactivity of the bioactive marine natural product halenaquinone with biomimetic nucleophiles. Bioorg Med Chem Lett 21:1261-4 (2011)  
Target
Name:
Phospholipase A2
Synonyms:
Allergen Api m I PA2_APIME Phospholipase A2 (Bee)
Type:
PROTEIN
Mol. Mass.:
19061.47
Organism:
Apis mellifera
Description:
ChEMBL_1277435
Residue:
167
  
Inhibitor
Name:
BDBM50336352
Synonyms:
(S)-tert-butyl 2-((5-hydroxy-12b-methyl-3,6,8,11-tetraoxo-1,2,3,12b-tetrahydrotetraphen-4(6H,8H,11H)-ylidene)methylamino)ethylcarbamate | CHEMBL1668040
Type:
Small organic molecule
Emp. Form.:
C27H28N2O7
Mol. Mass.:
492.5204
SMILES:
CC(C)(C)OC(=O)NCCNC=C1C2C(=O)C(=O)c3cc4C(=O)C=CC(=O)c4cc3[C@]2(C)CCC1=O
: