Target
Kappa-type opioid receptor
Ligand
BDBM50336670
Substrate
Meas. Tech.
ChEMBL_722916 (CHEMBL1674427)
Ki
0.108±n/a nM
Citation
 Nemoto, TYamamoto, NWatanabe, AFujii, HHasebe, KNakajima, MMochizuki, HNagase, H Synthesis of 6,14-epoxymorphinan derivatives and their pharmacologies. Bioorg Med Chem 19:1205-21 (2011)  
Target
Name:
Kappa-type opioid receptor
Synonyms:
Kappa Opioid Receptor OPRK1 Opiate Kappa 1 | mu/kappa opioid receptor
Type:
G Protein-Coupled Receptor (GPCR)
Mol. Mass.:
42744.99
Organism:
Cavia porcellus (domestic guinea pig)
Description:
P41144
Residue:
380
  
Inhibitor
Name:
BDBM50336670
Synonyms:
CHEMBL1672478 | N-[(6beta,14beta-Epoxy-3-hydroxy-17-isobutylmorphinan-6alpha-yl)methyl]benzamide
Type:
Small organic molecule
Emp. Form.:
C28H34N2O3
Mol. Mass.:
446.5812
SMILES:
CC(C)CN1CC[C@]23C[C@]4(CNC(=O)c5ccccc5)CC[C@@]2(O4)[C@H]1Cc1ccc(O)cc31
: