Target
Kappa-type opioid receptor
Ligand
BDBM50336672
Substrate
Meas. Tech.
ChEMBL_722916 (CHEMBL1674427)
Ki
0.0754±n/a nM
Citation
 Nemoto, TYamamoto, NWatanabe, AFujii, HHasebe, KNakajima, MMochizuki, HNagase, H Synthesis of 6,14-epoxymorphinan derivatives and their pharmacologies. Bioorg Med Chem 19:1205-21 (2011)  
Target
Name:
Kappa-type opioid receptor
Synonyms:
Kappa Opioid Receptor OPRK1 Opiate Kappa 1 | mu/kappa opioid receptor
Type:
G Protein-Coupled Receptor (GPCR)
Mol. Mass.:
42744.99
Organism:
Cavia porcellus (domestic guinea pig)
Description:
P41144
Residue:
380
  
Inhibitor
Name:
BDBM50336672
Synonyms:
CHEMBL1672473 | N-[(17-Cyclopropylmethyl-6beta,14beta-epoxy-3-hydroxymorphinan-6alpha-yl)methyl]-3-hydroxybenzamide
Type:
Small organic molecule
Emp. Form.:
C28H32N2O4
Mol. Mass.:
460.5647
SMILES:
Oc1cccc(c1)C(=O)NC[C@@]12CC[C@@]3(O1)[C@H]1Cc4ccc(O)cc4[C@]3(C2)CCN1CC1CC1
: