Target
Mu-type opioid receptor
Ligand
BDBM50336667
Substrate
Meas. Tech.
ChEMBL_722917 (CHEMBL1674428)
Ki
0.109±n/a nM
Citation
 Nemoto, TYamamoto, NWatanabe, AFujii, HHasebe, KNakajima, MMochizuki, HNagase, H Synthesis of 6,14-epoxymorphinan derivatives and their pharmacologies. Bioorg Med Chem 19:1205-21 (2011)  
Target
Name:
Mu-type opioid receptor
Synonyms:
M-OR-1 Mu opioid receptor OPIATE Mu OPRM_CAVPO
Type:
Enzyme Catalytic Domain
Mol. Mass.:
11165.58
Organism:
GUINEA PIG
Description:
P97266
Residue:
98
  
Inhibitor
Name:
BDBM50336667
Synonyms:
CHEMBL1672470 | N-[(17-Cyclopropylmethyl-6beta,14beta-epoxy-3-hydroxymorphinan-6alpha-yl)methyl]-2-methylbenzamide
Type:
Small organic molecule
Emp. Form.:
C29H34N2O3
Mol. Mass.:
458.5919
SMILES:
Cc1ccccc1C(=O)NC[C@@]12CC[C@@]3(O1)[C@H]1Cc4ccc(O)cc4[C@]3(C2)CCN1CC1CC1
: