Target
Mu-type opioid receptor
Ligand
BDBM50336668
Substrate
Meas. Tech.
ChEMBL_722917 (CHEMBL1674428)
Ki
0.27±n/a nM
Citation
 Nemoto, TYamamoto, NWatanabe, AFujii, HHasebe, KNakajima, MMochizuki, HNagase, H Synthesis of 6,14-epoxymorphinan derivatives and their pharmacologies. Bioorg Med Chem 19:1205-21 (2011)  
Target
Name:
Mu-type opioid receptor
Synonyms:
M-OR-1 Mu opioid receptor OPIATE Mu OPRM_CAVPO
Type:
Enzyme Catalytic Domain
Mol. Mass.:
11165.58
Organism:
GUINEA PIG
Description:
P97266
Residue:
98
  
Inhibitor
Name:
BDBM50336668
Synonyms:
CHEMBL1672476 | N-[(17-Cyclopropylmethyl-6beta,14beta-epoxy-3-hydroxymorphinan-6alpha-yl)methyl]-N,4-dimethylbenzamide
Type:
Small organic molecule
Emp. Form.:
C30H36N2O3
Mol. Mass.:
472.6184
SMILES:
CN(C[C@@]12CC[C@@]3(O1)[C@H]1Cc4ccc(O)cc4[C@]3(C2)CCN1CC1CC1)C(=O)c1ccc(C)cc1
: