Target
Tyrosine-protein kinase JAK2
Ligand
BDBM50337382
Substrate
Meas. Tech.
ChEMBL_726537 (CHEMBL1685432)
Ki
>1450±n/a nM
Citation
 Akritopoulou-Zanze, IWakefield, BDGasiecki, AKalvin, DJohnson, EFKovar, PDjuric, SW Scaffold oriented synthesis. Part 4: design, synthesis and biological evaluation of novel 5-substituted indazoles as potent and selective kinase inhibitors employing heterocycle forming and multicomponent reactions. Bioorg Med Chem Lett 21:1480-3 (2011)  
Target
Name:
Tyrosine-protein kinase JAK2
Synonyms:
JAK-2 JAK2_HUMAN Janus kinase 2 (JAK2) | Janus kinase 2 (a protein tyrosine kinase)
Type:
Protein
Mol. Mass.:
130684.68
Organism:
Homo sapiens (Human)
Description:
O60674
Residue:
1132
  
Inhibitor
Name:
BDBM50337382
Synonyms:
2-(4-(4-fluorophenyl)-5-(1H-indazol-5-yl)-1H-imidazol-1-yl)-N,N-dimethylethanamine | CHEMBL1682557
Type:
Small organic molecule
Emp. Form.:
C20H20FN5
Mol. Mass.:
349.4047
SMILES:
CN(C)CCn1cnc(c1-c1ccc2[nH]ncc2c1)-c1ccc(F)cc1
: