Target
Glucocorticoid receptor
Ligand
BDBM50338324
Substrate
Meas. Tech.
ChEMBL_726914 (CHEMBL1686703)
EC50
0.6±n/a nM
Citation
 Roach, SLHiguchi, RIHudson, ARVassar, AGrant, VHLamer, RHooper, CRungta, DSyka, PMMais, DEMarschke, KBZhi, L Tetrahydroquinolin-3-yl carbamate glucocorticoid receptor agonists with reduced PEPCK activation. Bioorg Med Chem Lett 21:1658-62 (2011)  
Target
Name:
Glucocorticoid receptor
Synonyms:
GCR_HUMAN GRL Glucocorticoid receptor (GRFP) Nuclear receptor subfamily 3 group C member 1
Type:
Enzyme
Mol. Mass.:
85656.87
Organism:
Homo sapiens (Human)
Description:
P04150
Residue:
777
  
Inhibitor
Name:
BDBM50338324
Synonyms:
(+/-)-(3R,4S)-5,7-difluoro-6-(1H-indol-7-yl)-2,2,4-trimethyl-1,2,3,4-tetrahydroquinolin-3-ol | CHEMBL1682441
Type:
Small organic molecule
Emp. Form.:
C20H20F2N2O
Mol. Mass.:
342.3824
SMILES:
C[C@@H]1[C@@H](O)C(C)(C)Nc2cc(F)c(c(F)c12)-c1cccc2cc[nH]c12
: